Moderator Control Panel ]

TBS6281 Fedora 26 compillation

It's important to keep your driver and software updated.

TBS6281 Fedora 26 compillation

Postby mollcons » Sat Jul 15, 2017 6:43 am

I have just upgraded my Fedora 25 to Fedora 26 and am reinstalling the drivers for my saa716 card.
All went well until running the command ./v4l/ when during processing I got an error as shown below:

/home/root/linux-tbs-drivers/linux-tbs-drivers/v4l/saa7146_vbi.c: In function 'vbi_workaround':
/home/root/linux-tbs-drivers/linux-tbs-drivers/v4l/saa7146_vbi.c:117:6: error: implicit declaration of function 'signal_pending'; did you mean 'timer_pending'? [-Werror=implicit-function-declaration]
if(signal_pending(current)) {
CC [M] /home/root/linux-tbs-drivers/linux-tbs-drivers/v4l/saa716x_pci.o
CC [M] /home/root/linux-tbs-drivers/linux-tbs-drivers/v4l/saa716x_i2c.o
cc1: some warnings being treated as errors
make[3]: *** [scripts/ /home/root/linux-tbs-drivers/linux-tbs-drivers/v4l/saa7146_vbi.o] Error 1
make[3]: *** Waiting for unfinished jobs....
make[2]: *** [Makefile:1496: _module_/home/root/linux-tbs-drivers/linux-tbs-drivers/v4l] Error 2
make[2]: Leaving directory '/usr/src/kernels/4.11.9-300.fc26.x86_64'
make[1]: *** [Makefile:52: default] Error 2
make[1]: Leaving directory '/home/root/linux-tbs-drivers/linux-tbs-drivers/v4l'
make: *** [Makefile:26: all] Error 2

How do I fix this error?
Posts: 9
Joined: Mon Oct 26, 2015 5:39 am
Location: Chester, UK

Re: TBS6281 Fedora 26 compillation

Postby gogoa » Tue Aug 22, 2017 8:21 pm

Try to patch Linux Driver v170330 with patch in
(toxiczka is geek :D :D )

His patch helped me. I compiled it for TBS6618 ...

PS for TBS support:
Could you please correct Linux Driver v170330 for us, Fedora 26 users with kernel 4.12.?
Thanks :)
Posts: 3
Joined: Wed Jan 25, 2017 3:29 pm

Return to Driver & Software Update

Who is online

Users browsing this forum: No registered users and 2 guests